Unit test full_name and org. fields

- test that it works, and that MYSQL will truncate fields
4 jobs for 43-unittests in 57 seconds (queued for 1 second)
Name Stage Failure
failed
Go-py3.6 Test There is an unknown failure, please try again
FAILED (errors=2)
Creating test database for alias 'default'...
Retrieving information from the peoplefinder api.
Retrieving information from the peoplefinder api.
Name not found in peoplefinder.
Retrieving information from the peoplefinder api.
Retrieving information from the peoplefinder api.
Destroying test database for alias 'default'...
ERROR: Build failed: exit code 1
failed
Go-py3.5 Test There is an unknown failure, please try again
FAILED (errors=2)
Creating test database for alias 'default'...
Retrieving information from the peoplefinder api.
Retrieving information from the peoplefinder api.
Name not found in peoplefinder.
Retrieving information from the peoplefinder api.
Retrieving information from the peoplefinder api.
Destroying test database for alias 'default'...
ERROR: Build failed: exit code 1
failed
Go-py3.4 Test There is an unknown failure, please try again
Retrieving information from the peoplefinder api.
Retrieving information from the peoplefinder api.
Destroying test database for alias 'default'...

----------------------------------------------------------------------
Ran 45 tests in 0.964s

FAILED (errors=2)
ERROR: Build failed: exit code 1
failed
Go-py2.7 Test There is an unknown failure, please try again
FAILED (errors=2)
Creating test database for alias 'default'...
Retrieving information from the peoplefinder api.
Retrieving information from the peoplefinder api.
Name not found in peoplefinder.
Retrieving information from the peoplefinder api.
Retrieving information from the peoplefinder api.
Destroying test database for alias 'default'...
ERROR: Build failed: exit code 1