Finish first pass of test_models

- everything has at least one test now
- 504 lines later
- tests are of pretty ok quality, can be fairly sure models is tested to
it's extent now
4 jobs for 2.2-dev in 1 minute and 10 seconds (queued for 2 seconds)
Name Stage Failure
failed
Go-py3.6 Test There is an unknown failure, please try again
FAILED (errors=1)
Creating test database for alias 'default'...
Retrieving information from the peoplefinder api.
Retrieving information from the peoplefinder api.
Name not found in peoplefinder.
Retrieving information from the peoplefinder api.
Retrieving information from the peoplefinder api.
Destroying test database for alias 'default'...
ERROR: Build failed: exit code 1
failed
Go-py3.5 Test There is an unknown failure, please try again
FAILED (errors=1)
Creating test database for alias 'default'...
Retrieving information from the peoplefinder api.
Retrieving information from the peoplefinder api.
Name not found in peoplefinder.
Retrieving information from the peoplefinder api.
Retrieving information from the peoplefinder api.
Destroying test database for alias 'default'...
ERROR: Build failed: exit code 1
failed
Go-py3.4 Test There is an unknown failure, please try again
  File "/usr/local/lib/python3.4/site-packages/redis/connection.py", line 442, in connect
raise ConnectionError(self._error_message(e))
redis.exceptions.ConnectionError: Error 2 connecting to unix socket: /var/run/redis/redis.sock. No such file or directory.

----------------------------------------------------------------------
Ran 63 tests in 2.419s

FAILED (errors=1)
ERROR: Build failed: exit code 1
failed
Go-py2.7 Test There is an unknown failure, please try again
FAILED (errors=1)
Creating test database for alias 'default'...
Retrieving information from the peoplefinder api.
Retrieving information from the peoplefinder api.
Name not found in peoplefinder.
Retrieving information from the peoplefinder api.
Retrieving information from the peoplefinder api.
Destroying test database for alias 'default'...
ERROR: Build failed: exit code 1