Oh fun, gitlab-ci breaks

- redis-server not found -- let's try starting it
4 jobs for 2.2-dev in 1 minute and 32 seconds (queued for 1 second)
Status Job ID Name Coverage
  Test
failed #2010
Go-py2.7

00:00:56

failed #2011
Go-py3.4

00:01:32

failed #2012
Go-py3.5

00:01:02

failed #2013
Go-py3.6

00:01:03

 
Name Stage Failure
failed
Go-py2.7 Test There is an unknown failure, please try again
FAILED (errors=1)
Creating test database for alias 'default'...
Retrieving information from the peoplefinder api.
Retrieving information from the peoplefinder api.
Name not found in peoplefinder.
Retrieving information from the peoplefinder api.
Retrieving information from the peoplefinder api.
Destroying test database for alias 'default'...
ERROR: Build failed: exit code 1
failed
Go-py3.4 Test There is an unknown failure, please try again
  File "/usr/local/lib/python3.4/site-packages/redis/connection.py", line 442, in connect
raise ConnectionError(self._error_message(e))
redis.exceptions.ConnectionError: Error 2 connecting to unix socket: /var/run/redis/redis.sock. No such file or directory.

----------------------------------------------------------------------
Ran 63 tests in 1.074s

FAILED (errors=1)
ERROR: Build failed: exit code 1
failed
Go-py3.5 Test There is an unknown failure, please try again
FAILED (errors=1)
Creating test database for alias 'default'...
Retrieving information from the peoplefinder api.
Retrieving information from the peoplefinder api.
Name not found in peoplefinder.
Retrieving information from the peoplefinder api.
Retrieving information from the peoplefinder api.
Destroying test database for alias 'default'...
ERROR: Build failed: exit code 1
failed
Go-py3.6 Test There is an unknown failure, please try again
  File "/usr/local/lib/python3.6/site-packages/redis/connection.py", line 442, in connect
raise ConnectionError(self._error_message(e))
redis.exceptions.ConnectionError: Error 2 connecting to unix socket: /var/run/redis/redis.sock. No such file or directory.

----------------------------------------------------------------------
Ran 63 tests in 1.459s

FAILED (errors=1)
ERROR: Build failed: exit code 1