Finish first pass on index tests

- To be honest I'm pretty dissapointed by the support for integration
test for views
- There are some things you can do with like RequestFactory but I have
not found a way to test the way we handle Users that works well
- For now, just ping that the page renders -- maybe in the future work
on improving test_views
4 jobs for 43-unittests in 1 minute and 2 seconds (queued for 2 seconds)
Status Job ID Name Coverage
  Test
failed #2168
Go-py2.7

00:00:57

failed #2169
Go-py3.4

00:00:56

failed #2170
Go-py3.5

00:01:01

failed #2171
Go-py3.6

00:01:00

 
Name Stage Failure
failed
Go-py3.5 Test There is an unknown failure, please try again
    raise ConnectionError(self._error_message(e))
redis.exceptions.ConnectionError: Error 2 connecting to unix socket: /var/run/redis/redis.sock. No such file or directory.

----------------------------------------------------------------------
Ran 75 tests in 3.289s

FAILED (errors=4)
Destroying test database for alias 'default'...
ERROR: Build failed: exit code 1
failed
Go-py2.7 Test There is an unknown failure, please try again


Retrieving information from the peoplefinder api.
Retrieving information from the peoplefinder api.
Name not found in peoplefinder.
Retrieving information from the peoplefinder api.
Retrieving information from the peoplefinder api.
Destroying test database for alias 'default'...
ERROR: Build failed: exit code 1
failed
Go-py3.4 Test There is an unknown failure, please try again
    raise ConnectionError(self._error_message(e))
redis.exceptions.ConnectionError: Error 2 connecting to unix socket: /var/run/redis/redis.sock. No such file or directory.
Destroying test database for alias 'default'...

----------------------------------------------------------------------
Ran 75 tests in 2.093s

FAILED (errors=4)
ERROR: Build failed: exit code 1
failed
Go-py3.6 Test There is an unknown failure, please try again
    raise ConnectionError(self._error_message(e))
redis.exceptions.ConnectionError: Error 2 connecting to unix socket: /var/run/redis/redis.sock. No such file or directory.
Destroying test database for alias 'default'...

----------------------------------------------------------------------
Ran 75 tests in 3.532s

FAILED (errors=4)
ERROR: Build failed: exit code 1