Uncomment out the critical section

- I'm not sure how I feel about this relationship gitlab-ci, do things
  need to be so aggressive
4 jobs for 43-unittests in 1 minute and 9 seconds (queued for 3 seconds)
Name Stage Failure
failed
Go-py3.6 Test There is an unknown failure, please try again
    raise ConnectionError(self._error_message(e))
redis.exceptions.ConnectionError: Error 111 connecting to localhost:6379. Connection refused.

----------------------------------------------------------------------
Ran 75 tests in 3.799s

FAILED (errors=4)
Destroying test database for alias 'default'...
ERROR: Build failed: exit code 1
failed
Go-py3.5 Test There is an unknown failure, please try again
    raise ConnectionError(self._error_message(e))
redis.exceptions.ConnectionError: Error 111 connecting to localhost:6379. Connection refused.

----------------------------------------------------------------------
Ran 75 tests in 2.143s

FAILED (errors=4)
Destroying test database for alias 'default'...
ERROR: Build failed: exit code 1
failed
Go-py3.4 Test There is an unknown failure, please try again
    raise ConnectionError(self._error_message(e))
redis.exceptions.ConnectionError: Error 111 connecting to localhost:6379. Connection refused.

----------------------------------------------------------------------
Ran 75 tests in 2.166s

FAILED (errors=4)
Destroying test database for alias 'default'...
ERROR: Build failed: exit code 1
failed
Go-py2.7 Test There is an unknown failure, please try again


Retrieving information from the peoplefinder api.
Retrieving information from the peoplefinder api.
Name not found in peoplefinder.
Retrieving information from the peoplefinder api.
Retrieving information from the peoplefinder api.
Destroying test database for alias 'default'...
ERROR: Build failed: exit code 1