Add AGPLv3 notices to files

1 job for develop in 3 seconds
Status Job ID Name Coverage
failed #1789


Name Stage Failure
test_lib-ical Test There is an unknown failure, please try again
npm ERR! Failed to parse package.json data.
npm ERR! package.json must be actual JSON, not just JavaScript.
npm ERR!
npm ERR! This is not a bug in npm.
npm ERR! Tell the package author to fix their package.json file. JSON.parse

npm ERR! Please include the following file with any support request:
npm ERR! /builds/srct/lib-ical/npm-debug.log
ERROR: Build failed: exit code 1